new.ID,time,StartDate,EndDate,Progress,Duration..in.seconds.,Finished,RecordedDate,18+,Agree,Age,Gender,Sex_birth,Hispanic,Race,State,Urban,Relationship,Education,Own,Income,Employment,COVemploy,Essential,Children_5,Mental.health,Immuno,Chronic,Pregnant,Preg_first,Preg_week_4,COV_symp,COV_changes,COV_iso,COV_iso_day_4,COV_iso_guide,Guide_contact,Guide_hygiene,Smoker,Smoker_Pre_cig,Smoker_post_cig,Drinker,Drinker_post,Sitting_pre_1,Sitting_pre_2,Sitting_post_1,Sitting_post_2,Outside_pre_1,Outside_pre_2,Outside_post_1,Outside_post_2,Mod_pre_1,Mod_pre_2,Mod_post_1,Mod_post_2,Vig_pre_1,Vig_pre_2,Vig_post_1,Vig_post_2,Screen_pre_1,Screen_pre_2,Screen_post_1,Screen_post_2,Distress_4,BDI_1,BDI_2,BDI_3,BDI_4,BDI_5,BDI_6,BDI_7,BDI_8,BDI_10,BDI_11,BDI_12,BDI_13,BDI_14,BDI_15,BDI_16,BDI_17,BDI_18,BDI_19,BDI_20,BDI_21,BAI_1,BAI_2,BAI_3,BAI_4,BAI_5,BAI_6,BAI_7,BAI_8,BAI_9,BAI_10,BAI_11,BAI_12,BAI_13,BAI_14,BAI_15,BAI_16,BAI_17,BAI_18,BAI_19,BAI_20,BAI_21,BDI_total,BMI,Lone_total,PSS4_total,SNI.3,BAI_total,WEMWBS_total,SNI_total,Work_changes,RTE_post_days_1,RTE_post_mins_1,RTE_post_intensity,Yoga_post_days_4,Yoga_post_mins_1,Sleep_post_1,BDI_9,SSRPH_1,SSRPH_2,SSRPH_3,SSRPH_4,SSRPH_5,SSOSH_1,SSOSH_2,SSOSH_3,SSOSH_4,SSOSH_5,SSOSH_6,SSOSH_7,SSOSH_8,SSOSH_9,SSOSH_10,PAST_THERAPY,PAST_THERAPYSESSIONS_1,PAST_THERAPYSESSIONS_2,LIVING_WITHADULTS_1,LIVING_WITHADULTS_2,MHSAS_1,MHSAS_2,MHSAS_3,MHSAS_4,MHSAS_5,MHSAS_6,MHSAS_7,MHSAS_8,MHSAS_9,CURRENT_THERAPY,INTENTIONS,Videoconference,Start_Date,Helpfulness,Symptom_Change,Online_Attitudes_1,Online_Attitudes_2,Online_Attitudes_3,Online_Attitudes_4,Online_Attitudes_5,Online_Attitudes_6,Online_Attitudes_7,Online_Attitudes_8,Online_Attitudes_9,Online_Attitudes_10,Online_comments,School_return,School_class_type,School_child_class_type,Vaccine_received,Vaccine_doses,Vaccine_type,Vaccine_intent,Sitting_pre_total,Sitting_post_total,Outside_pre_total,Outside_post_total,Mod_pre_daily,Mod_post_daily,Vig_pre_daily,Vig_post_daily,Mod_post_weekly,Vig_post_weekly,MVPA_post_weekly,Screen_pre_total,Screen_post_total,BMI_range
1,baseline,4/3/20 17:22,4/3/20 17:41,100,1151,1,4/3/20 17:41,1,1,5,1,1,6,White,South,1,1,8,1,5,1,2,NA,2,,3,2,NA,NA,NA,4,"3,5",NA,NA,,5,"3,8",2,NA,NA,1,3,3,0,5,0,1,15,1,30,0,15,0,15,0,25,0,30,8,0,9,0,2,0,0,0,0,0,0,0,0,0,0,0,0,0,0,1,0,0,0,0,0,1,0,0,0,1,0,1,0,0,0,0,1,0,0,0,0,0,1,0,0,0,1.05,24.8,3,3,14,5,28,14,NA,NA,NA,NA,NA,NA,NA,NA,NA,NA,NA,NA,NA,NA,NA,NA,NA,NA,NA,NA,NA,NA,NA,NA,NA,NA,NA,NA,NA,NA,NA,NA,NA,NA,NA,NA,NA,NA,NA,NA,,NA,NA,NA,NA,NA,NA,NA,NA,NA,NA,NA,NA,,,NA,NA,NA,NA,NA,NA,180,300,75,90,15,15,25,30,105,210,525,480,540,NA
1,week1,4/11/20 11:09,4/11/20 11:17,100,464,1,4/11/20 11:17,NA,NA,NA,NA,NA,NA,,NA,NA,2,NA,NA,NA,,NA,NA,NA,,NA,NA,NA,NA,NA,4,4,NA,NA,,5,3,2,NA,NA,1,3,NA,NA,7,30,NA,NA,10,15,NA,NA,0,15,NA,NA,0,30,NA,NA,6,0,2,0,0,0,1,0,0,0,0,0,0,0,0,0,1,0,0,0,0,0,NA,0,0,0,0,0,1,0,0,0,0,0,1,0,0,0,0,0,0,1,0,0,2.1,NA,4,3,10,3,27,10,4,0,NA,NA,0,NA,8,0,NA,NA,NA,NA,NA,NA,NA,NA,NA,NA,NA,NA,NA,NA,NA,NA,NA,NA,NA,NA,NA,NA,NA,NA,NA,NA,NA,NA,NA,NA,NA,NA,,NA,NA,NA,NA,NA,NA,NA,NA,NA,NA,NA,NA,,,NA,NA,NA,NA,NA,NA,NA,450,NA,615,NA,15,NA,30,105,210,525,NA,360,NA
2,baseline,4/3/20 17:39,4/3/20 17:46,100,438,1,4/3/20 17:46,1,1,1,1,1,6,White,Midwest,2,2,5,3,7,1,2,NA,0,,3,3,NA,NA,NA,4,5,NA,NA,,"5,6,8",2,2,NA,NA,1,1,6,0,12,0,2,0,0,0,0,20,0,0,0,10,0,0,4,0,8,0,5,0,1,0,2,0,0,0,0,0,1,2,0,0,2,1,0,1,1,0,0,0,0,0,0,0,0,1,0,0,0,0,1,1,0,0,0,0,0,0,0,0,11.55,22.1,5,6,8,3,18,8,NA,NA,NA,NA,NA,NA,NA,NA,NA,NA,NA,NA,NA,NA,NA,NA,NA,NA,NA,NA,NA,NA,NA,NA,NA,NA,NA,NA,NA,NA,NA,NA,NA,NA,NA,NA,NA,NA,NA,NA,,NA,NA,NA,NA,NA,NA,NA,NA,NA,NA,NA,NA,,,NA,NA,NA,NA,NA,NA,360,720,120,0,20,0,10,0,0,0,0,240,480,NA
2,month1,7/3/20 22:45,7/3/20 22:49,100,265,1,7/3/20 22:49,NA,NA,NA,NA,NA,NA,,NA,NA,2,NA,NA,NA,,NA,NA,NA,,NA,NA,NA,NA,NA,1,5,NA,NA,,8,2,2,NA,NA,1,1,NA,NA,10,0,NA,NA,2,0,NA,NA,1,0,NA,NA,4,0,NA,NA,12,0,6,0,2,1,2,0,0,0,0,0,2,2,0,0,0,0,0,2,0,0,NA,0,0,0,0,0,0,0,0,0,0,0,0,0,0,0,0,0,0,0,0,0,11.55,NA,3,7,NA,0,20,10,4,0,NA,NA,0,NA,9,0,NA,NA,NA,NA,NA,NA,NA,NA,NA,NA,NA,NA,NA,NA,NA,NA,NA,NA,NA,NA,NA,NA,NA,NA,NA,NA,NA,NA,NA,NA,NA,NA,,NA,NA,NA,NA,NA,NA,NA,NA,NA,NA,NA,NA,,,NA,NA,NA,NA,NA,NA,NA,600,NA,120,NA,60,NA,240,420,1680,3780,NA,720,NA
2,month10,4/5/21 13:06,4/5/21 13:09,100,171,1,4/5/21 13:09,NA,NA,NA,NA,NA,NA,,NA,NA,2,NA,NA,NA,,NA,NA,NA,,NA,NA,NA,NA,NA,4,,NA,NA,,6,2,2,NA,NA,1,2,NA,NA,8,0,NA,NA,2,0,NA,NA,4,0,NA,NA,1,0,NA,NA,5,0,4,0,0,0,0,0,0,0,0,0,0,0,0,0,0,0,0,0,0,0,NA,0,0,0,1,0,0,1,1,0,1,0,1,1,0,0,0,0,0,0,0,0,0,NA,3,3,NA,6,28,11,4,0,NA,NA,0,NA,8,0,NA,NA,NA,NA,NA,NA,NA,NA,NA,NA,NA,NA,NA,NA,NA,NA,NA,NA,NA,NA,NA,NA,NA,NA,NA,NA,NA,NA,NA,NA,NA,NA,,NA,NA,NA,NA,NA,NA,NA,NA,NA,NA,NA,NA,,,NA,NA,2,NA,NA,1,NA,480,NA,120,NA,240,NA,60,1680,420,2520,NA,300,NA
2,month11,5/3/21 13:36,5/3/21 13:47,100,632,1,5/3/21 13:47,NA,NA,NA,NA,NA,NA,,NA,NA,2,NA,NA,NA,,NA,NA,NA,,NA,NA,NA,NA,NA,4,,NA,NA,,8,1,2,NA,NA,1,2,NA,NA,8,0,NA,NA,3,0,NA,NA,NA,30,NA,NA,0,30,NA,NA,9,0,7,0,1,1,1,1,0,0,1,1,1,1,0,1,0,1,1,1,1,0,NA,0,0,0,2,0,0,2,0,0,2,0,1,1,0,0,0,0,0,0,0,0,13.65,NA,3,7,NA,8,23,11,18,0,NA,NA,0,NA,4,0,NA,NA,NA,NA,NA,NA,NA,NA,NA,NA,NA,NA,NA,NA,NA,NA,NA,NA,NA,NA,NA,NA,NA,NA,NA,NA,NA,NA,NA,NA,NA,NA,,NA,NA,NA,NA,NA,NA,NA,NA,NA,NA,NA,NA,,,NA,NA,1,2,1,NA,NA,480,NA,180,NA,NA,NA,30,NA,210,NA,NA,540,NA
2,month12,6/4/21 14:41,6/4/21 14:46,100,282,1,6/4/21 14:46,NA,NA,NA,NA,NA,NA,,NA,NA,2,NA,NA,NA,,NA,NA,NA,,NA,NA,NA,NA,NA,5,,NA,NA,,,1,2,NA,NA,1,1,NA,NA,11,0,NA,NA,1,0,NA,NA,2,0,NA,NA,0,0,NA,NA,11,0,5,0,1,1,0,2,0,0,2,2,1,1,0,0,1,0,1,0,0,0,NA,0,0,0,2,1,0,1,1,0,2,0,1,1,0,0,0,0,0,0,0,0,12.6,NA,3,5,NA,9,20,10,10,0,NA,NA,0,NA,9,0,NA,NA,NA,NA,NA,NA,NA,NA,NA,NA,NA,NA,NA,NA,NA,NA,NA,NA,NA,NA,NA,NA,NA,NA,NA,NA,NA,NA,NA,NA,NA,NA,,NA,NA,NA,NA,NA,NA,NA,NA,NA,NA,NA,NA,,,NA,NA,1,1,1,NA,NA,660,NA,60,NA,120,NA,0,840,0,840,NA,660,NA
2,month2,8/3/20 12:01,8/3/20 12:11,100,590,1,8/3/20 12:11,NA,NA,NA,NA,NA,NA,,NA,NA,2,NA,NA,NA,,NA,NA,NA,,NA,NA,NA,NA,NA,4,5,NA,NA,,5,2,2,NA,NA,1,1,NA,NA,10,0,NA,NA,3,0,NA,NA,1,0,NA,NA,1,0,NA,NA,10,0,5,0,1,0,0,0,0,0,0,0,0,0,0,0,0,0,0,0,0,0,NA,0,0,0,0,0,0,0,0,0,1,0,0,0,0,0,0,1,0,0,0,0,1.05,NA,6,4,NA,2,25,9,4,0,NA,NA,0,NA,8,0,NA,NA,NA,NA,NA,NA,NA,NA,NA,NA,NA,NA,NA,NA,NA,NA,NA,NA,NA,NA,NA,NA,NA,NA,NA,NA,NA,NA,NA,NA,NA,NA,,NA,NA,NA,NA,NA,NA,NA,NA,NA,NA,NA,NA,,,NA,NA,NA,NA,NA,NA,NA,600,NA,180,NA,60,NA,60,420,420,1260,NA,600,NA
2,month3,9/3/20 12:04,9/3/20 12:10,100,369,1,9/3/20 12:10,NA,NA,NA,NA,NA,NA,,NA,NA,2,NA,NA,NA,,NA,NA,NA,,NA,NA,NA,NA,NA,4,2,NA,NA,,"7,8",1,2,NA,NA,1,1,NA,NA,10,0,NA,NA,1,0,NA,NA,0,0,NA,NA,0,0,NA,NA,7,0,3,0,1,1,1,0,0,0,0,0,1,0,0,1,0,1,0,2,0,0,NA,0,0,0,2,0,0,0,0,0,0,0,0,0,0,0,0,0,0,0,0,0,8.4,NA,5,6,NA,2,21,9,5,0,NA,NA,0,NA,8,0,NA,NA,NA,NA,NA,NA,NA,NA,NA,NA,NA,NA,NA,NA,NA,NA,NA,NA,NA,NA,NA,NA,NA,NA,NA,NA,NA,NA,NA,NA,NA,NA,,NA,NA,NA,NA,NA,NA,NA,NA,NA,NA,NA,NA,,1,3,NA,NA,NA,NA,NA,NA,600,NA,60,NA,0,NA,0,0,0,0,NA,420,NA
2,month4,10/5/20 12:55,10/5/20 13:00,100,286,1,10/5/20 13:00,NA,NA,NA,NA,NA,NA,,NA,NA,2,NA,NA,NA,,NA,NA,NA,,NA,NA,NA,NA,NA,4,5,NA,NA,,"7,8",2,2,NA,NA,1,2,NA,NA,12,0,NA,NA,5,0,NA,NA,0,0,NA,NA,0,0,NA,NA,12,0,6,1,1,0,2,0,0,1,0,2,1,1,0,1,1,2,0,2,1,1,NA,0,0,0,0,1,0,0,0,0,2,0,0,0,0,0,0,0,0,0,0,0,17.85,NA,3,8,NA,3,22,10,1,0,NA,NA,0,NA,7,0,NA,NA,NA,NA,NA,NA,NA,NA,NA,NA,NA,NA,NA,NA,NA,NA,NA,NA,NA,NA,NA,NA,NA,NA,NA,NA,NA,NA,NA,NA,NA,NA,,NA,NA,NA,NA,NA,NA,NA,NA,NA,NA,NA,NA,,,NA,NA,NA,NA,NA,NA,NA,720,NA,300,NA,0,NA,0,0,0,0,NA,720,NA
2,month5,11/3/20 18:58,11/3/20 19:05,100,387,1,11/3/20 19:05,NA,NA,NA,NA,NA,NA,,NA,NA,2,NA,NA,NA,,NA,NA,NA,,NA,NA,NA,NA,NA,4,5,NA,NA,,8,1,2,NA,NA,1,2,NA,NA,10,0,NA,NA,1,0,NA,NA,1,0,NA,NA,0,0,NA,NA,8,0,6,0,1,0,0,0,0,0,0,0,0,0,0,1,0,0,0,2,0,1,NA,0,0,0,0,0,0,0,0,0,0,0,0,0,0,0,0,0,0,0,0,0,5.25,NA,4,7,NA,0,20,10,1,0,NA,NA,0,NA,7,0,NA,NA,NA,NA,NA,NA,NA,NA,NA,NA,NA,NA,NA,NA,NA,NA,NA,NA,NA,NA,NA,NA,NA,NA,NA,NA,NA,NA,NA,NA,NA,NA,,NA,NA,NA,NA,NA,NA,NA,NA,NA,NA,NA,NA,,,NA,NA,NA,NA,NA,NA,NA,600,NA,60,NA,60,NA,0,420,0,420,NA,480,NA
2,month6,12/4/20 19:28,12/4/20 19:33,100,303,1,12/4/20 19:33,NA,NA,NA,NA,NA,NA,,NA,NA,2,NA,NA,NA,,NA,NA,NA,,NA,NA,NA,NA,NA,4,5,NA,NA,,8,1,2,NA,NA,1,2,NA,NA,12,0,NA,NA,0.5,0,NA,NA,0,0,NA,NA,0,0,NA,NA,8,0,2,0,1,0,2,0,0,0,0,0,0,0,0,0,1,0,0,0,0,0,NA,0,0,0,0,0,0,0,0,0,1,0,0,0,0,0,0,0,0,0,0,0,4.2,NA,4,6,NA,1,19,9,5,0,NA,NA,0,NA,4,0,NA,NA,NA,NA,NA,NA,NA,NA,NA,NA,NA,NA,NA,NA,NA,NA,NA,NA,NA,NA,NA,NA,NA,NA,NA,NA,NA,NA,NA,NA,NA,NA,,NA,NA,NA,NA,NA,NA,NA,NA,NA,NA,NA,NA,,,NA,NA,NA,NA,NA,NA,NA,720,NA,30,NA,0,NA,0,0,0,0,NA,480,NA
2,month7,1/4/21 20:59,1/4/21 21:03,100,278,1,1/4/21 21:03,NA,NA,NA,NA,NA,NA,,NA,NA,2,NA,NA,NA,,NA,NA,NA,,NA,NA,NA,NA,NA,4,,NA,NA,,8,2,2,NA,NA,1,2,NA,NA,10,0,NA,NA,2,0,NA,NA,1,0,NA,NA,0,0,NA,NA,8,0,3,1,1,0,1,0,0,0,0,0,1,1,0,1,0,0,0,0,0,1,NA,0,0,0,2,0,0,0,0,0,0,0,0,0,0,0,0,0,0,0,0,0,7.35,NA,4,5,NA,2,23,9,4,0,NA,NA,0,NA,8,0,NA,NA,NA,NA,NA,NA,NA,NA,NA,NA,NA,NA,NA,NA,NA,NA,NA,NA,NA,NA,NA,NA,NA,NA,NA,NA,NA,NA,NA,NA,NA,NA,,NA,NA,NA,NA,NA,NA,NA,NA,NA,NA,NA,NA,,,NA,NA,NA,NA,NA,NA,NA,600,NA,120,NA,60,NA,0,420,0,420,NA,480,NA
2,month8,2/3/21 15:21,2/3/21 15:33,100,702,1,2/3/21 15:33,NA,NA,NA,NA,NA,NA,,NA,NA,2,NA,NA,NA,,NA,NA,NA,,NA,NA,NA,NA,NA,4,5,NA,NA,,6,"1,7",2,NA,NA,1,2,NA,NA,8,0,NA,NA,2,0,NA,NA,3,0,NA,NA,1,0,NA,NA,7,0,7,0,1,0,2,1,0,0,1,2,1,1,0,1,1,3,0,1,1,0,NA,0,0,0,2,1,0,0,0,1,1,0,1,1,0,0,0,0,0,0,0,0,16.8,NA,3,6,NA,7,19,13,4,0,NA,NA,0,NA,2,0,NA,NA,NA,NA,NA,NA,NA,NA,NA,NA,NA,NA,NA,NA,NA,NA,NA,NA,NA,NA,NA,NA,NA,NA,NA,NA,NA,NA,NA,NA,NA,NA,,NA,NA,NA,NA,NA,NA,NA,NA,NA,NA,NA,NA,,,NA,NA,NA,NA,NA,NA,NA,480,NA,120,NA,180,NA,60,1260,420,2100,NA,420,NA
2,month9,3/4/21 14:19,3/4/21 14:27,100,512,1,3/4/21 14:27,NA,NA,NA,NA,NA,NA,,NA,NA,2,NA,NA,NA,,NA,NA,NA,,NA,NA,NA,NA,NA,4,,NA,NA,,,1,2,NA,NA,1,2,NA,NA,8,0,NA,NA,2,0,NA,NA,5,0,NA,NA,1,0,NA,NA,7,0,5,0,1,0,0,0,0,0,2,3,0,1,0,1,0,1,0,1,0,0,NA,0,0,0,0,0,0,0,0,0,0,0,0,0,0,0,0,0,0,0,0,0,11.55,NA,3,4,NA,0,21,13,1,0,NA,NA,0,NA,7,1,NA,NA,NA,NA,NA,NA,NA,NA,NA,NA,NA,NA,NA,NA,NA,NA,NA,NA,NA,NA,NA,NA,NA,NA,NA,NA,NA,NA,NA,NA,NA,NA,,NA,NA,NA,NA,NA,NA,NA,NA,NA,NA,NA,NA,,,NA,NA,2,NA,NA,2,NA,480,NA,120,NA,300,NA,60,2100,420,2940,NA,420,NA
2,week1,4/10/20 12:05,4/10/20 12:10,100,304,1,4/10/20 12:10,NA,NA,NA,NA,NA,NA,,NA,NA,2,NA,NA,NA,,NA,NA,NA,,NA,NA,NA,NA,NA,4,1,4,0,,8,3,2,NA,NA,1,1,NA,NA,8,0,NA,NA,2,0,NA,NA,0,0,NA,NA,0,0,NA,NA,8,0,3,0,0,0,0,0,0,0,0,0,0,0,0,0,0,0,0,0,0,0,NA,0,0,0,0,0,0,0,0,0,0,0,0,0,0,0,0,0,0,0,0,0,0,NA,3,5,7,0,26,7,1,0,NA,NA,0,NA,8,0,NA,NA,NA,NA,NA,NA,NA,NA,NA,NA,NA,NA,NA,NA,NA,NA,NA,NA,NA,NA,NA,NA,NA,NA,NA,NA,NA,NA,NA,NA,NA,NA,,NA,NA,NA,NA,NA,NA,NA,NA,NA,NA,NA,NA,,,NA,NA,NA,NA,NA,NA,NA,480,NA,120,NA,0,NA,0,0,0,0,NA,480,NA
2,week2,4/17/20 13:50,4/17/20 13:54,100,250,1,4/17/20 13:54,NA,NA,NA,NA,NA,NA,,NA,NA,2,NA,NA,NA,,NA,NA,NA,,NA,NA,NA,NA,NA,4,"4,5",NA,NA,,"5,8",2,2,NA,NA,1,1,NA,NA,12,0,NA,NA,1,0,NA,NA,1,0,NA,NA,0,0,NA,NA,8,0,4,0,1,1,2,1,0,0,0,0,2,1,1,1,0,0,0,1,1,1,NA,0,0,0,1,1,0,0,0,0,1,0,0,0,0,0,0,0,0,0,0,0,13.65,NA,3,6,NA,3,21,9,1,0,NA,NA,0,NA,9,0,NA,NA,NA,NA,NA,NA,NA,NA,NA,NA,NA,NA,NA,NA,NA,NA,NA,NA,NA,NA,NA,NA,NA,NA,NA,NA,NA,NA,NA,NA,NA,NA,,NA,NA,NA,NA,NA,NA,NA,NA,NA,NA,NA,NA,,,NA,NA,NA,NA,NA,NA,NA,720,NA,60,NA,60,NA,0,420,0,420,NA,480,NA
2,week3,4/24/20 12:24,4/24/20 12:27,100,229,1,4/24/20 12:27,NA,NA,NA,NA,NA,NA,,NA,NA,2,NA,NA,NA,,NA,NA,NA,,NA,NA,NA,NA,NA,4,5,NA,NA,,"5,7,8",2,2,NA,NA,1,1,NA,NA,10,0,NA,NA,2,0,NA,NA,1,0,NA,NA,1,0,NA,NA,10,0,3,0,0,0,0,0,0,0,0,0,1,0,0,2,1,0,0,2,0,1,NA,0,0,0,0,0,0,0,1,0,0,0,0,0,0,0,0,0,0,0,0,0,7.35,NA,3,2,NA,1,28,9,1,0,NA,NA,0,NA,9,0,NA,NA,NA,NA,NA,NA,NA,NA,NA,NA,NA,NA,NA,NA,NA,NA,NA,NA,NA,NA,NA,NA,NA,NA,NA,NA,NA,NA,NA,NA,NA,NA,,NA,NA,NA,NA,NA,NA,NA,NA,NA,NA,NA,NA,,,NA,NA,NA,NA,NA,NA,NA,600,NA,120,NA,60,NA,60,420,420,1260,NA,600,NA
2,week4,5/1/20 14:45,5/1/20 14:48,100,174,1,5/1/20 14:48,NA,NA,NA,NA,NA,NA,,NA,NA,2,NA,NA,NA,,NA,NA,NA,,NA,NA,NA,NA,NA,4,5,NA,NA,,6,2,2,NA,NA,1,1,NA,NA,12,0,NA,NA,2,0,NA,NA,1,0,NA,NA,1,0,NA,NA,8,0,4,0,0,0,0,0,0,0,0,0,0,0,0,0,0,0,0,0,0,0,NA,0,0,0,0,0,0,0,0,0,0,0,0,0,0,0,0,0,0,0,0,0,0,NA,5,7,NA,0,26,9,1,0,NA,NA,0,NA,7,0,NA,NA,NA,NA,NA,NA,NA,NA,NA,NA,NA,NA,NA,NA,NA,NA,NA,NA,NA,NA,NA,NA,NA,NA,NA,NA,NA,NA,NA,NA,NA,NA,,NA,NA,NA,NA,NA,NA,NA,NA,NA,NA,NA,NA,,,NA,NA,NA,NA,NA,NA,NA,720,NA,120,NA,60,NA,60,420,420,1260,NA,480,NA
2,week5,5/9/20 12:39,5/9/20 12:44,100,303,1,5/9/20 12:44,NA,NA,NA,NA,NA,NA,,NA,NA,2,NA,NA,NA,,NA,NA,NA,,NA,NA,NA,NA,NA,4,5,NA,NA,,"2,6",1,2,NA,NA,1,1,NA,NA,12,0,NA,NA,4,0,NA,NA,1,0,NA,NA,1,0,NA,NA,10,0,9,0,1,1,3,1,0,0,1,2,3,2,1,2,0,1,1,1,1,2,NA,0,0,0,0,0,0,0,0,0,0,0,0,0,0,0,0,0,0,0,0,0,24.15,NA,5,8,NA,0,16,9,4,0,NA,NA,0,NA,7,0,NA,NA,NA,NA,NA,NA,NA,NA,NA,NA,NA,NA,NA,NA,NA,NA,NA,NA,NA,NA,NA,NA,NA,NA,NA,NA,NA,NA,NA,NA,NA,NA,,NA,NA,NA,NA,NA,NA,NA,NA,NA,NA,NA,NA,,,NA,NA,NA,NA,NA,NA,NA,720,NA,240,NA,60,NA,60,420,420,1260,NA,600,NA
2,week6,5/15/20 12:05,5/15/20 12:09,100,218,1,5/15/20 12:09,NA,NA,NA,NA,NA,NA,,NA,NA,2,NA,NA,NA,,NA,NA,NA,,NA,NA,NA,NA,NA,4,5,NA,NA,,5,1,2,NA,NA,1,1,NA,NA,10,0,NA,NA,2,0,NA,NA,0,0,NA,NA,0,0,NA,NA,10,0,1,0,1,1,0,0,0,0,0,0,0,0,1,0,0,0,0,0,0,0,NA,0,0,0,0,0,0,0,0,0,0,0,0,0,0,0,0,0,0,0,0,0,3.15,NA,3,8,NA,0,22,10,6,0,NA,NA,0,NA,8,0,NA,NA,NA,NA,NA,NA,NA,NA,NA,NA,NA,NA,NA,NA,NA,NA,NA,NA,NA,NA,NA,NA,NA,NA,NA,NA,NA,NA,NA,NA,NA,NA,,NA,NA,NA,NA,NA,NA,NA,NA,NA,NA,NA,NA,,,NA,NA,NA,NA,NA,NA,NA,600,NA,120,NA,0,NA,0,0,0,0,NA,600,NA
2,week7,5/22/20 13:50,5/22/20 13:55,100,294,1,5/22/20 13:55,NA,NA,NA,NA,NA,NA,,NA,NA,2,NA,NA,NA,,NA,NA,NA,,NA,NA,NA,NA,NA,4,5,NA,NA,,"6,8",2,2,NA,NA,1,1,NA,NA,12,0,NA,NA,2,0,NA,NA,0,0,NA,NA,0,0,NA,NA,12,0,2,0,1,1,0,0,0,0,0,0,0,0,0,0,0,0,0,0,0,0,NA,0,0,0,0,0,0,0,0,0,1,0,0,0,0,0,0,0,0,0,0,0,2.1,NA,3,5,NA,1,23,9,4,0,NA,NA,0,NA,10,0,2,1,3,1,2,1,4,1,4,3,2,5,2,2,2,2,NA,NA,3,0,NA,NA,NA,NA,NA,NA,NA,NA,NA,NA,NA,NA,,NA,NA,NA,NA,NA,NA,NA,NA,NA,NA,NA,NA,,,NA,NA,NA,NA,NA,NA,NA,720,NA,120,NA,0,NA,0,0,0,0,NA,720,NA
2,week8,5/29/20 12:01,5/29/20 12:06,100,279,1,5/29/20 12:06,NA,NA,NA,NA,NA,NA,,NA,NA,2,NA,NA,NA,,NA,NA,NA,,NA,NA,NA,NA,NA,4,5,NA,NA,,"6,8",2,2,NA,NA,1,1,NA,NA,12,0,NA,NA,4,0,NA,NA,1,0,NA,NA,0,0,NA,NA,10,0,3,0,0,0,0,0,0,0,0,0,0,0,0,0,0,0,0,0,0,0,NA,0,0,0,0,0,0,0,0,0,0,0,0,0,0,0,0,0,0,0,0,0,0,NA,3,3,NA,0,30,9,4,0,NA,NA,0,NA,10,0,NA,NA,NA,NA,NA,NA,NA,NA,NA,NA,NA,NA,NA,NA,NA,NA,NA,NA,NA,NA,6,7,7,6,2,1,5,4,4,2,1,NA,,NA,NA,3,1,5,5,3,3,6,4,4,3,,,NA,NA,NA,NA,NA,NA,NA,720,NA,240,NA,60,NA,0,420,0,420,NA,600,NA
3,baseline,4/3/20 17:38,4/3/20 17:46,100,490,1,4/3/20 17:46,1,1,2,2,2,6,White,West,1,1,6,1,5,1,2,NA,0,1,3,2,2,NA,NA,4,4,NA,NA,,"1,3,4","3,8",2,NA,NA,1,2,6,0,6,0,1,0,2,0,0,30,2,0,0,30,2,0,6,0,6,0,3,0,1,0,0,0,0,0,0,0,1,0,0,0,0,2,0,1,0,0,0,0,0,0,0,0,0,0,0,0,0,0,0,0,0,0,0,0,0,0,0,0,5.25,29.5,3,5,15,0,27,15,NA,NA,NA,NA,NA,NA,NA,NA,NA,NA,NA,NA,NA,NA,NA,NA,NA,NA,NA,NA,NA,NA,NA,NA,NA,NA,NA,NA,NA,NA,NA,NA,NA,NA,NA,NA,NA,NA,NA,NA,,NA,NA,NA,NA,NA,NA,NA,NA,NA,NA,NA,NA,,,NA,NA,NA,NA,NA,NA,360,360,60,120,30,120,30,120,840,840,2520,360,360,NA
3,month1,7/5/20 16:05,7/5/20 16:09,100,235,1,7/5/20 16:09,NA,NA,NA,NA,NA,NA,,NA,NA,2,NA,NA,NA,,NA,NA,NA,,NA,NA,NA,NA,NA,4,5,NA,NA,,,"2,8",2,NA,NA,1,3,NA,NA,6,0,NA,NA,3,0,NA,NA,1,0,NA,NA,0,30,NA,NA,6,0,2,0,0,0,0,0,0,0,0,0,0,0,0,0,0,0,0,0,0,0,NA,0,0,0,0,0,0,0,0,0,0,0,0,0,0,0,0,0,0,0,0,0,0,NA,3,5,NA,0,28,15,10,2,20,1,3,20,8,0,NA,NA,NA,NA,NA,NA,NA,NA,NA,NA,NA,NA,NA,NA,NA,NA,NA,NA,NA,NA,NA,NA,NA,NA,NA,NA,NA,NA,NA,NA,NA,NA,,NA,NA,NA,NA,NA,NA,NA,NA,NA,NA,NA,NA,,,NA,NA,NA,NA,NA,NA,NA,360,NA,180,NA,60,NA,30,420,210,840,NA,360,NA
3,month2,8/4/20 22:26,8/4/20 22:30,100,288,1,8/4/20 22:30,NA,NA,NA,NA,NA,NA,,NA,NA,2,NA,NA,NA,,NA,NA,NA,,NA,NA,NA,NA,NA,4,,NA,NA,,"3,4,6","3,8",2,NA,NA,1,1,NA,NA,10,0,NA,NA,1,0,NA,NA,0,45,NA,NA,0,30,NA,NA,9,0,1,0,0,0,0,0,0,0,0,0,0,0,0,0,0,0,1,0,0,0,NA,0,0,0,0,0,0,0,0,0,0,0,0,0,0,0,0,0,0,0,0,0,1.05,NA,3,4,NA,0,28,15,6,2,20,1,4,20,8,0,NA,NA,NA,NA,NA,NA,NA,NA,NA,NA,NA,NA,NA,NA,NA,NA,NA,NA,NA,NA,NA,NA,NA,NA,NA,NA,NA,NA,NA,NA,NA,NA,,NA,NA,NA,NA,NA,NA,NA,NA,NA,NA,NA,NA,,,NA,NA,NA,NA,NA,NA,NA,600,NA,60,NA,45,NA,30,315,210,735,NA,540,NA
3,month3,9/17/20 13:00,9/17/20 13:07,100,385,1,9/17/20 13:07,NA,NA,NA,NA,NA,NA,,NA,NA,2,NA,NA,NA,,NA,NA,NA,,NA,NA,NA,NA,NA,4,,NA,NA,,,"2,8",2,NA,NA,1,1,NA,NA,8,0,NA,NA,1,0,NA,NA,1,0,NA,NA,0,30,NA,NA,8,0,2,0,0,0,0,0,0,0,0,0,0,0,0,0,0,0,0,0,0,0,NA,0,0,0,0,0,0,0,0,0,0,0,0,0,0,0,0,0,0,0,0,0,0,NA,3,2,NA,0,32,14,1,2,20,1,3,30,8,0,NA,NA,NA,NA,NA,NA,NA,NA,NA,NA,NA,NA,NA,NA,NA,NA,NA,NA,NA,NA,NA,NA,NA,NA,NA,NA,NA,NA,NA,NA,NA,NA,,NA,NA,NA,NA,NA,NA,NA,NA,NA,NA,NA,NA,,3,NA,NA,NA,NA,NA,NA,NA,480,NA,60,NA,60,NA,30,420,210,840,NA,480,NA
3,week2,4/17/20 12:17,4/17/20 12:23,100,320,1,4/17/20 12:23,NA,NA,NA,NA,NA,NA,,NA,NA,2,NA,NA,NA,,NA,NA,NA,,NA,NA,NA,NA,NA,4,"3,4,5",NA,NA,,"1,3,4,6","2,8",2,NA,NA,1,3,NA,NA,8,0,NA,NA,2,0,NA,NA,1,30,NA,NA,0,30,NA,NA,10,0,3,0,0,0,0,0,0,0,0,1,0,0,0,0,1,1,0,0,0,0,NA,0,0,0,0,0,0,0,0,0,1,0,0,0,0,0,0,1,0,0,0,0,3.15,NA,3,5,NA,2,27,15,4,3,30,1,5,25,6,0,NA,NA,NA,NA,NA,NA,NA,NA,NA,NA,NA,NA,NA,NA,NA,NA,NA,NA,NA,NA,NA,NA,NA,NA,NA,NA,NA,NA,NA,NA,NA,NA,,NA,NA,NA,NA,NA,NA,NA,NA,NA,NA,NA,NA,,,NA,NA,NA,NA,NA,NA,NA,480,NA,120,NA,90,NA,30,630,210,1050,NA,600,NA
3,week3,4/24/20 14:34,4/24/20 14:40,100,382,1,4/24/20 14:41,NA,NA,NA,NA,NA,NA,,NA,NA,2,NA,NA,NA,,NA,NA,NA,,NA,NA,NA,NA,NA,4,"4,5",NA,NA,,"1,2,3,4,6","3,8",2,NA,NA,1,3,NA,NA,8,0,NA,NA,2,0,NA,NA,6,0,NA,NA,3,0,NA,NA,10,0,2,0,0,0,0,0,0,0,0,1,0,0,0,0,1,0,1,1,0,0,NA,0,0,0,0,0,0,0,0,0,0,0,0,0,0,0,0,0,0,0,0,0,4.2,NA,3,4,NA,0,29,15,4,3,30,2,4,30,7,0,NA,NA,NA,NA,NA,NA,NA,NA,NA,NA,NA,NA,NA,NA,NA,NA,NA,NA,NA,NA,NA,NA,NA,NA,NA,NA,NA,NA,NA,NA,NA,NA,,NA,NA,NA,NA,NA,NA,NA,NA,NA,NA,NA,NA,,,NA,NA,NA,NA,NA,NA,NA,480,NA,120,NA,360,NA,180,2520,1260,5040,NA,600,NA
3,week4,5/1/20 12:18,5/1/20 12:22,100,237,1,5/1/20 12:22,NA,NA,NA,NA,NA,NA,,NA,NA,2,NA,NA,NA,,NA,NA,NA,,NA,NA,NA,NA,NA,4,"3,5",NA,NA,,1,"2,8",2,NA,NA,1,3,NA,NA,10,0,NA,NA,2,0,NA,NA,1,0,NA,NA,0,30,NA,NA,10,0,3,0,0,0,0,0,0,0,0,1,0,0,0,0,1,0,0,0,0,0,NA,0,0,0,0,0,0,0,0,0,1,0,0,0,0,0,0,0,0,0,0,0,2.1,NA,3,4,NA,1,28,15,4,3,30,2,5,30,8,0,NA,NA,NA,NA,NA,NA,NA,NA,NA,NA,NA,NA,NA,NA,NA,NA,NA,NA,NA,NA,NA,NA,NA,NA,NA,NA,NA,NA,NA,NA,NA,NA,,NA,NA,NA,NA,NA,NA,NA,NA,NA,NA,NA,NA,,,NA,NA,NA,NA,NA,NA,NA,600,NA,120,NA,60,NA,30,420,210,840,NA,600,NA
3,week5,5/11/20 14:09,5/11/20 14:13,100,248,1,5/11/20 14:13,NA,NA,NA,NA,NA,NA,,NA,NA,2,NA,NA,NA,,NA,NA,NA,,NA,NA,NA,NA,NA,4,"3,5",NA,NA,,1,"3,8",2,NA,NA,1,3,NA,NA,10,0,NA,NA,2,0,NA,NA,1,NA,NA,NA,0,30,NA,NA,8,0,2,0,0,0,0,0,0,0,0,0,0,0,0,0,1,0,0,0,0,0,NA,0,0,0,0,0,0,0,0,0,0,0,0,0,0,0,0,0,0,0,0,0,1.05,NA,3,8,NA,0,28,15,4,3,30,2,5,30,8,0,NA,NA,NA,NA,NA,NA,NA,NA,NA,NA,NA,NA,NA,NA,NA,NA,NA,NA,NA,NA,NA,NA,NA,NA,NA,NA,NA,NA,NA,NA,NA,NA,,NA,NA,NA,NA,NA,NA,NA,NA,NA,NA,NA,NA,,,NA,NA,NA,NA,NA,NA,NA,600,NA,120,NA,NA,NA,30,NA,210,NA,NA,480,NA
3,week7,5/22/20 16:43,5/22/20 16:47,100,261,1,5/22/20 16:47,NA,NA,NA,NA,NA,NA,,NA,NA,2,NA,NA,NA,,NA,NA,NA,,NA,NA,NA,NA,NA,4,5,NA,NA,,1,"3,8",2,NA,NA,1,3,NA,NA,8,0,NA,NA,2,0,NA,NA,1,30,NA,NA,0,30,NA,NA,8,0,1,0,0,0,0,0,0,0,0,0,0,0,0,0,1,0,1,0,0,0,NA,0,0,0,0,0,0,0,0,0,0,0,0,0,0,0,0,0,0,0,0,0,2.1,NA,3,4,NA,0,28,15,4,3,30,2,3,30,8,0,2,1,2,2,2,1,5,1,4,4,1,4,1,2,1,1,0,12,1,0,NA,NA,NA,NA,NA,NA,NA,NA,NA,NA,NA,NA,,NA,NA,NA,NA,NA,NA,NA,NA,NA,NA,NA,NA,,,NA,NA,NA,NA,NA,NA,NA,480,NA,120,NA,90,NA,30,630,210,1050,NA,480,NA
3,week8,5/29/20 14:24,5/29/20 14:42,100,1131,1,5/29/20 14:42,NA,NA,NA,NA,NA,NA,,NA,NA,2,NA,NA,NA,,NA,NA,NA,,NA,NA,NA,NA,NA,4,,NA,NA,,"3,4","3,8",2,NA,NA,1,3,NA,NA,6,0,NA,NA,4,0,NA,NA,2,0,NA,NA,1,0,NA,NA,8,0,3,0,0,0,0,0,0,0,0,0,0,0,0,0,0,0,0,0,0,0,NA,0,0,0,0,0,0,0,0,0,0,0,0,0,0,0,0,0,0,0,0,0,0,NA,3,4,NA,0,27,15,10,3,30,1,3,30,7,0,NA,NA,NA,NA,NA,NA,NA,NA,NA,NA,NA,NA,NA,NA,NA,NA,NA,NA,NA,NA,6,2,6,6,2,2,5,3,3,2,3,NA,,NA,NA,5,2,4,3,5,4,4,4,4,2,,,NA,NA,NA,NA,NA,NA,NA,360,NA,240,NA,120,NA,60,840,420,1680,NA,480,NA
4,baseline,4/3/20 17:38,4/3/20 17:46,100,481,1,4/3/20 17:46,1,1,2,2,2,6,White,Midwest,2,2,8,3,7,1,2,NA,0,,3,2,2,NA,NA,5,1,NA,0,,,"3,4",2,NA,NA,1,1,10,0,10,0,0,30,0,10,0,20,0,0,1,0,0,0,10,0,11,0,5,1,0,0,0,0,0,0,1,1,1,0,0,0,0,0,1,1,0,1,0,0,1,0,1,1,0,1,0,0,2,0,0,1,1,0,0,1,2,0,0,0,7.35,23.9,5,6,11,11,25,11,NA,NA,NA,NA,NA,NA,NA,NA,NA,NA,NA,NA,NA,NA,NA,NA,NA,NA,NA,NA,NA,NA,NA,NA,NA,NA,NA,NA,NA,NA,NA,NA,NA,NA,NA,NA,NA,NA,NA,NA,,NA,NA,NA,NA,NA,NA,NA,NA,NA,NA,NA,NA,,,NA,NA,NA,NA,NA,NA,600,600,30,10,20,0,60,0,0,0,0,600,660,NA
4,month1,7/6/20 8:41,7/6/20 8:46,100,341,1,7/6/20 8:46,NA,NA,NA,NA,NA,NA,,NA,NA,2,NA,NA,NA,,NA,NA,NA,,NA,NA,NA,NA,NA,2,5,NA,NA,,"1,3,4,6,8","1,2,3,8",2,NA,NA,1,1,NA,NA,10,0,NA,NA,0,30,NA,NA,0,30,NA,NA,0,0,NA,NA,12,0,5,1,1,0,0,1,0,0,1,0,0,0,0,0,1,0,1,0,0,0,NA,0,1,0,0,2,0,0,0,1,2,0,0,0,0,0,1,1,2,0,0,0,6.3,NA,6,5,NA,10,25,10,4,1,30,1,0,NA,8,0,NA,NA,NA,NA,NA,NA,NA,NA,NA,NA,NA,NA,NA,NA,NA,NA,NA,NA,NA,NA,NA,NA,NA,NA,NA,NA,NA,NA,NA,NA,NA,NA,,NA,NA,NA,NA,NA,NA,NA,NA,NA,NA,NA,NA,,,NA,NA,NA,NA,NA,NA,NA,600,NA,30,NA,30,NA,0,210,0,210,NA,720,NA
4,month10,4/5/21 12:02,4/7/21 8:56,100,161663,1,4/7/21 8:56,NA,NA,NA,NA,NA,NA,,NA,NA,2,NA,NA,NA,,NA,NA,NA,,NA,NA,NA,NA,NA,5,5,NA,NA,,"1,3,4,6,8","1,2,3,8",2,NA,NA,1,3,NA,NA,10,0,NA,NA,0,10,NA,NA,0,0,NA,NA,0,0,NA,NA,10,0,4,0,0,1,0,1,0,0,0,0,0,0,0,0,0,0,0,0,0,0,NA,0,1,0,0,1,0,1,0,0,2,0,0,0,0,2,0,0,2,0,0,1,2.1,NA,4,4,NA,10,29,10,4,0,NA,NA,0,NA,7,0,NA,NA,NA,NA,NA,NA,NA,NA,NA,NA,NA,NA,NA,NA,NA,NA,NA,NA,NA,NA,NA,NA,NA,NA,NA,NA,NA,NA,NA,NA,NA,NA,,NA,NA,NA,NA,NA,NA,NA,NA,NA,NA,NA,NA,,,NA,NA,1,2,2,NA,NA,600,NA,10,NA,0,NA,0,0,0,0,NA,600,NA
4,month11,5/6/21 9:47,5/6/21 10:32,100,2692,1,5/6/21 10:32,NA,NA,NA,NA,NA,NA,,NA,NA,2,NA,NA,NA,,NA,NA,NA,,NA,NA,NA,NA,NA,5,5,NA,NA,,"1,3,4,6,8","1,2,3,8",2,NA,NA,1,1,NA,NA,9,0,NA,NA,0,10,NA,NA,2,0,NA,NA,0,0,NA,NA,10,0,4,0,0,1,0,0,0,0,0,0,0,0,0,0,1,0,1,0,0,0,NA,0,0,0,0,1,0,1,0,0,1,0,0,0,0,1,0,0,2,0,0,0,3.15,NA,4,4,NA,6,28,10,4,0,NA,NA,0,NA,8,0,NA,NA,NA,NA,NA,NA,NA,NA,NA,NA,NA,NA,NA,NA,NA,NA,NA,NA,NA,NA,NA,NA,NA,NA,NA,NA,NA,NA,NA,NA,NA,NA,,NA,NA,NA,NA,NA,NA,NA,NA,NA,NA,NA,NA,,,NA,NA,1,1,2,NA,NA,540,NA,10,NA,120,NA,0,840,0,840,NA,600,NA
4,month12,6/3/21 13:40,6/3/21 13:45,100,285,1,6/3/21 13:45,NA,NA,NA,NA,NA,NA,,NA,NA,2,NA,NA,NA,,NA,NA,NA,,NA,NA,NA,NA,NA,5,5,NA,NA,,9,"1,2,3,8",2,NA,NA,1,3,NA,NA,10,0,NA,NA,1,0,NA,NA,0,30,NA,NA,0,0,NA,NA,11,0,5,0,1,0,0,0,0,1,0,0,0,0,0,0,1,0,0,0,0,0,NA,0,1,0,0,3,0,0,0,2,2,0,0,0,0,1,3,2,1,0,0,0,3.15,NA,4,4,NA,15,28,10,4,0,NA,NA,0,NA,7,0,NA,NA,NA,NA,NA,NA,NA,NA,NA,NA,NA,NA,NA,NA,NA,NA,NA,NA,NA,NA,NA,NA,NA,NA,NA,NA,NA,NA,NA,NA,NA,NA,,NA,NA,NA,NA,NA,NA,NA,NA,NA,NA,NA,NA,,,NA,NA,1,1,2,NA,NA,600,NA,60,NA,30,NA,0,210,0,210,NA,660,NA
4,month3,9/17/20 15:39,9/17/20 15:44,100,269,1,9/17/20 15:44,NA,NA,NA,NA,NA,NA,,NA,NA,2,NA,NA,NA,,NA,NA,NA,,NA,NA,NA,NA,NA,5,5,NA,NA,,"1,3,4,6,8","1,2,3,8",2,NA,NA,1,1,NA,NA,10,0,NA,NA,0,10,NA,NA,0,0,NA,NA,0,0,NA,NA,11,0,6,1,1,1,0,1,0,0,1,0,0,0,0,0,1,0,0,0,0,0,NA,0,1,0,0,2,0,0,0,2,2,0,0,0,1,0,1,2,1,0,0,0,7.35,NA,5,6,NA,12,28,10,4,2,30,1,0,NA,9,1,NA,NA,NA,NA,NA,NA,NA,NA,NA,NA,NA,NA,NA,NA,NA,NA,NA,NA,NA,NA,NA,NA,NA,NA,NA,NA,NA,NA,NA,NA,NA,NA,,NA,NA,NA,NA,NA,NA,NA,NA,NA,NA,NA,NA,,3,NA,NA,NA,NA,NA,NA,NA,600,NA,10,NA,0,NA,0,0,0,0,NA,660,NA
4,month4,10/5/20 12:01,10/5/20 12:08,100,375,1,10/5/20 12:08,NA,NA,NA,NA,NA,NA,,NA,NA,2,NA,NA,NA,,NA,NA,NA,,NA,NA,NA,NA,NA,5,5,NA,NA,,"1,3,4,6,8","1,2,3,8",2,NA,NA,1,1,NA,NA,10,0,NA,NA,0,30,NA,NA,0,30,NA,NA,0,0,NA,NA,11,0,5,1,1,0,0,1,0,0,0,1,0,0,0,0,1,0,0,0,0,0,NA,0,0,0,0,2,0,0,0,1,2,0,0,0,0,0,1,1,1,0,0,0,5.25,NA,7,4,NA,8,26,10,1,1,20,1,0,NA,9,0,NA,NA,NA,NA,NA,NA,NA,NA,NA,NA,NA,NA,NA,NA,NA,NA,NA,NA,NA,NA,NA,NA,NA,NA,NA,NA,NA,NA,NA,NA,NA,NA,,NA,NA,NA,NA,NA,NA,NA,NA,NA,NA,NA,NA,,,NA,NA,NA,NA,NA,NA,NA,600,NA,30,NA,30,NA,0,210,0,210,NA,660,NA
4,month5,11/3/20 13:33,11/3/20 14:31,100,3470,1,11/3/20 14:31,NA,NA,NA,NA,NA,NA,,NA,NA,2,NA,NA,NA,,NA,NA,NA,,NA,NA,NA,NA,NA,2,5,NA,NA,,"1,3,4,6,8","1,2,3,8",2,NA,NA,1,1,NA,NA,10,0,NA,NA,0,30,NA,NA,0,0,NA,NA,0,0,NA,NA,10,0,7,1,1,1,0,0,0,0,1,0,0,1,0,0,1,0,1,0,0,0,NA,0,1,0,0,2,0,0,0,1,2,0,0,0,0,3,1,1,1,0,0,0,8.4,NA,4,5,NA,12,23,8,4,0,NA,NA,0,NA,9,1,NA,NA,NA,NA,NA,NA,NA,NA,NA,NA,NA,NA,NA,NA,NA,NA,NA,NA,NA,NA,NA,NA,NA,NA,NA,NA,NA,NA,NA,NA,NA,NA,,NA,NA,NA,NA,NA,NA,NA,NA,NA,NA,NA,NA,,,NA,NA,NA,NA,NA,NA,NA,600,NA,30,NA,0,NA,0,0,0,0,NA,600,NA